Target
Poly [ADP-ribose] polymerase 2
Ligand
BDBM50318567
Substrate
Meas. Tech.
ChEMBL_818393 (CHEMBL2034620)
IC50
114±n/a nM
Citation
 Narwal, MVenkannagari, HLehtiö, L Structural basis of selective inhibition of human tankyrases. J Med Chem 55:1360-7 (2012)  
Target
Name:
Poly [ADP-ribose] polymerase 2
Synonyms:
(ARTD2 or PARP2) ADPRTL2 PARP2_HUMAN Poly [ADP-ribose] polymerase 2 (PARP2)
Type:
Enzyme
Mol. Mass.:
66225.70
Organism:
Homo sapiens (Human)
Description:
Q9UGN5
Residue:
583
  
Inhibitor
Name:
BDBM50318567
Synonyms:
2-(4-(Trifluoromethyl)phenyl)-7,8-dihydro-5H-thiopyrano-[4,3-d]pyrimidin-4-ol CHEMBL1086580
Type:
Small organic molecule
Emp. Form.:
C14H11F3N2OS
Mol. Mass.:
312.31
SMILES:
FC(F)(F)c1ccc(cc1)-c1nc2CCSCc2c(=O)[nH]1
: