Target
DNA repair protein RAD51 homolog 1
Ligand
BDBM48804
Substrate
Meas. Tech.
ChEMBL_821854 (CHEMBL2039424)
Kd
5600±n/a nM
Citation
 Huang, FMazina, OMZentner, IJCocklin, SMazin, AV Inhibition of homologous recombination in human cells by targeting RAD51 recombinase. J Med Chem 55:3011-20 (2012)  
Target
Name:
DNA repair protein RAD51 homolog 1
Synonyms:
RAD51 RAD51_HUMAN | RECA
Type:
Enzyme Catalytic Domain
Mol. Mass.:
36960.74
Organism:
Homo sapiens (Human)
Description:
gi_49168602
Residue:
339
  
Inhibitor
Name:
BDBM48804
Synonyms:
3-(phenylmethyl)-2-[(E)-2-(3-pyridinyl)ethenyl]-4-quinazolinone 3-benzyl-2-[(E)-2-(3-pyridyl)vinyl]quinazolin-4-one MLS000709026 cid_5738263
Type:
Small organic molecule
Emp. Form.:
C22H17N3O
Mol. Mass.:
339.3899
SMILES:
O=c1n(Cc2ccccc2)c(\C=C\c2cccnc2)nc2ccccc12
: