Target
Penicillin-binding protein 2X
Ligand
BDBM50385266
Substrate
Meas. Tech.
ChEMBL_822530 (CHEMBL2039463)
IC50
481000±n/a nM
Citation
 Zervosen, ABouillez, AHerman, AAmoroso, AJoris, BSauvage, ECharlier, PLuxen, A Synthesis and evaluation of boronic acids as inhibitors of Penicillin Binding Proteins of classes A, B and C. Bioorg Med Chem 20:3915-24 (2012)  
Target
Name:
Penicillin-binding protein 2X
Synonyms:
PBP-2X PBPX_STRR6 | pbpX
Type:
PROTEIN
Mol. Mass.:
82337.09
Organism:
Streptococcus pneumoniae R6
Description:
ChEMBL_822530
Residue:
750
  
Inhibitor
Name:
BDBM50385266
Synonyms:
CHEMBL2035295
Type:
Small organic molecule
Emp. Form.:
C9H9BF3NO3
Mol. Mass.:
246.979
SMILES:
OB(O)CNC(=O)c1ccccc1C(F)(F)F
: