Target
Long-chain fatty acid transport protein 1
Ligand
BDBM50387670
Substrate
Meas. Tech.
ChEMBL_830659 (CHEMBL2061594)
IC50
>10000±n/a nM
Citation
 Matsufuji, TIkeda, MNaito, AHirouchi, MTakakusa, HKanda, SIzumi, MHarada, JShinozuka, T Discovery and optimization of novel fatty acid transport protein 1 (FATP1) inhibitors. Bioorg Med Chem Lett 22:5067-70 (2012)  
Target
Name:
Long-chain fatty acid transport protein 1
Synonyms:
6.2.1.- Fatp Fatty acid transport protein 1 Slc27a1 | Solute carrier family 27 member 1
Type:
PROTEIN
Mol. Mass.:
71289.41
Organism:
Mus musculus
Description:
ChEMBL_956919
Residue:
646
  
Inhibitor
Name:
BDBM50387670
Synonyms:
CHEMBL2058085
Type:
Small organic molecule
Emp. Form.:
C19H20ClN5OS
Mol. Mass.:
401.913
SMILES:
CCn1c(CNc2ccccc2)nnc1SCC(=O)Nc1ccc(Cl)cc1
: