Target
S-methyl-5'-thioadenosine phosphorylase
Ligand
BDBM50390253
Substrate
Meas. Tech.
ChEMBL_834947 (CHEMBL2073357)
Ki
368±n/a nM
Citation
 Clinch, KEvans, GBFröhlich, RFGulab, SAGutierrez, JAMason, JMSchramm, VLTyler, PCWoolhouse, AD Transition state analogue inhibitors of human methylthioadenosine phosphorylase and bacterial methylthioadenosine/S-adenosylhomocysteine nucleosidase incorporating acyclic ribooxacarbenium ion mimics. Bioorg Med Chem 20:5181-7 (2012)  
Target
Name:
S-methyl-5'-thioadenosine phosphorylase
Synonyms:
5'-Methylthioadenosine phosphorylase (MTAP) MTA phosphorylase MTAP_HUMAN Methylthioadenosine Phosphorylase (MTAP) | S-methyl-5 -thioadenosine phosphorylase
Type:
Enzyme
Mol. Mass.:
31239.23
Organism:
Homo sapiens (Human)
Description:
Residue:
283
  
Inhibitor
Name:
BDBM50390253
Synonyms:
CHEMBL2070407
Type:
Small organic molecule
Emp. Form.:
C13H21N5O2S
Mol. Mass.:
311.403
SMILES:
CSC[C@H](O)[C@@H](O)CN(C)Cc1c[nH]c2c(N)ncnc12
: