Target
Neuropeptide Y receptor type 5
Ligand
BDBM50394228
Substrate
Meas. Tech.
ChEMBL_856722 (CHEMBL2162548)
IC50
0.8±n/a nM
Citation
 Tamura, YOmori, NKouyama, NNishiura, YHayashi, KWatanabe, KTanaka, YChiba, TYukioka, HSato, HOkuno, T Identification of a novel and orally available benzimidazole derivative as an NPY Y5 receptor antagonist with in vivo efficacy. Bioorg Med Chem Lett 22:6554-8 (2012)  
Target
Name:
Neuropeptide Y receptor type 5
Synonyms:
NPY-Y5 Neuropeptide Y receptor Y5 Npy5 | Npy5r
Type:
Enzyme
Mol. Mass.:
52807.91
Organism:
Mus musculus (Mouse)
Description:
O70342
Residue:
466
  
Inhibitor
Name:
BDBM50394228
Synonyms:
CHEMBL2159171
Type:
Small organic molecule
Emp. Form.:
C20H23N3O3S
Mol. Mass.:
385.48
SMILES:
CCS(=O)(=O)c1ccc2nc([nH]c2c1)N1CCOC(C1)c1ccc(C)cc1
: