Target
Dipeptidyl peptidase 4
Ligand
BDBM50394237
Substrate
Meas. Tech.
ChEMBL_856733 (CHEMBL2162559)
IC50
17±n/a nM
Citation
 Lam, BZhang, ZStafford, JASkene, RJShi, LGwaltney, SL Structure-based design of pyridopyrimidinediones as dipeptidyl peptidase IV inhibitors. Bioorg Med Chem Lett 22:6628-31 (2012)  
Target
Name:
Dipeptidyl peptidase 4
Synonyms:
ADABP Adenosine deaminase complexing protein 2 CD_antigen=CD26 DPP4 DPPIV Dipeptidyl peptidase 4 (DPP IV) Dipeptidyl peptidase 4 (DPP4) Dipeptidyl peptidase 4 membrane form Dipeptidyl peptidase IV Dipeptidyl peptidase IV (DDP-IV) Dipeptidyl peptidase IV membrane form Dipeptidyl peptidase-IV (DPP-4) T-cell activation antigen CD26 | TP103
Type:
Enzyme
Mol. Mass.:
88271.01
Organism:
Homo sapiens (Human)
Description:
P27487
Residue:
766
  
Inhibitor
Name:
BDBM50394237
Synonyms:
CHEMBL2159182
Type:
Small organic molecule
Emp. Form.:
C16H16BrN5O2
Mol. Mass.:
390.235
SMILES:
Cn1c2nc(N)c(CN)c(-c3ccccc3Br)c2c(=O)n(C)c1=O
: