Target
Prothrombin
Ligand
BDBM50394256
Substrate
Meas. Tech.
ChEMBL_856937 (CHEMBL2160580)
Ki
6000±n/a nM
Citation
 Dosa, SStirnberg, MLülsdorff, VHäußler, DMaurer, EGütschow, M Active site mapping of trypsin, thrombin and matriptase-2 by sulfamoyl benzamidines. Bioorg Med Chem 20:6489-505 (2012)  
Target
Name:
Prothrombin
Synonyms:
Activation peptide fragment 1 Coagulation factor II Prothrombin precursor Thrombin heavy chain | Thrombin light chain
Type:
Protein
Mol. Mass.:
70029.57
Organism:
Homo sapiens (Human)
Description:
P00734
Residue:
622
  
Inhibitor
Name:
BDBM50394256
Synonyms:
CHEMBL2159274
Type:
Small organic molecule
Emp. Form.:
C24H28N6O3S
Mol. Mass.:
480.581
SMILES:
NC(=[NH2+])c1ccc(CNC(=O)[C@@H](Cc2ccccc2)NS(=O)(=O)c2ccc(cc2)C(N)=[NH2+])cc1
: