Target
Bromodomain-containing protein 4
Ligand
BDBM50397596
Substrate
Meas. Tech.
ChEMBL_873082 (CHEMBL2182558)
IC50
2600±n/a nM
Citation
 Bamborough, PDiallo, HGoodacre, JDGordon, LLewis, ASeal, JTWilson, DMWoodrow, MDChung, CW Fragment-based discovery of bromodomain inhibitors part 2: optimization of phenylisoxazole sulfonamides. J Med Chem 55:587-96 (2012)  
Target
Name:
Bromodomain-containing protein 4
Synonyms:
BRD4 Bromodomain-containing protein 4 (BRD4) Protein HUNK1
Type:
Protein
Mol. Mass.:
152264.84
Organism:
Homo sapiens (Human)
Description:
O60885
Residue:
1362
  
Inhibitor
Name:
BDBM50397596
Synonyms:
CHEMBL2181718
Type:
Small organic molecule
Emp. Form.:
C23H33N3O5S
Mol. Mass.:
463.59
SMILES:
Cc1noc(C)c1-c1ccc(OCCCN2CCOCC2)c(c1)S(=O)(=O)NC1CCCC1
: