Target
Beta-secretase 1
Ligand
BDBM50398892
Substrate
Meas. Tech.
ChEMBL_873597 (CHEMBL2187886)
Ki
850±n/a nM
Citation
 Gerritz, SWZhai, WShi, SZhu, SToyn, JHMeredith, JEIben, LGBurton, CRAlbright, CFGood, ACTebben, AJMuckelbauer, JKCamac, DMMetzler, WCook, LSPadmanabha, RLentz, KASofia, MJPoss, MAMacor, JEThompson, LA Acyl guanidine inhibitors ofß-secretase (BACE-1): optimization of a micromolar hit to a nanomolar lead via iterative solid- and solution-phase library synthesis. J Med Chem 55:9208-23 (2012)  
Target
Name:
Beta-secretase 1
Synonyms:
ASP2 Aspartyl protease 2 BACE1 Beta-secretase (BACE) Beta-secretase 1 (BACE 1) Beta-secretase 1 (BACE1) Beta-site amyloid precursor protein cleaving enzyme 1 Memapsin-2 beta-Secretase (BACE-1) | beta-Secretase (BACE1)
Type:
Protein
Mol. Mass.:
55755.10
Organism:
Homo sapiens (Human)
Description:
P56817
Residue:
501
  
Inhibitor
Name:
BDBM50398892
Synonyms:
CHEMBL2178173
Type:
Small organic molecule
Emp. Form.:
C25H27ClN4O3
Mol. Mass.:
466.96
SMILES:
CCC\C=C\c1cc(Cl)cc(CN=C(N)NC(=O)c2c(C)onc2-c2ccc(OC)cc2)c1
: