Target
Beta-secretase 1
Ligand
BDBM50398877
Substrate
Meas. Tech.
ChEMBL_873597 (CHEMBL2187886)
Ki
30±n/a nM
Citation
 Gerritz, SWZhai, WShi, SZhu, SToyn, JHMeredith, JEIben, LGBurton, CRAlbright, CFGood, ACTebben, AJMuckelbauer, JKCamac, DMMetzler, WCook, LSPadmanabha, RLentz, KASofia, MJPoss, MAMacor, JEThompson, LA Acyl guanidine inhibitors ofß-secretase (BACE-1): optimization of a micromolar hit to a nanomolar lead via iterative solid- and solution-phase library synthesis. J Med Chem 55:9208-23 (2012)  
Target
Name:
Beta-secretase 1
Synonyms:
ASP2 Aspartyl protease 2 BACE1 Beta-secretase (BACE) Beta-secretase 1 (BACE 1) Beta-secretase 1 (BACE1) Beta-site amyloid precursor protein cleaving enzyme 1 Memapsin-2 beta-Secretase (BACE-1) | beta-Secretase (BACE1)
Type:
Protein
Mol. Mass.:
55755.10
Organism:
Homo sapiens (Human)
Description:
P56817
Residue:
501
  
Inhibitor
Name:
BDBM50398877
Synonyms:
CHEMBL2178186
Type:
Small organic molecule
Emp. Form.:
C25H28ClN5O4S
Mol. Mass.:
530.039
SMILES:
COc1ccc(cc1)-c1noc(C)c1C(=O)NC(N)=NCc1cc(C)c(NC(=O)CCSC)c(Cl)c1
: