Target
Beta-secretase 1
Ligand
BDBM50398907
Substrate
Meas. Tech.
ChEMBL_873597 (CHEMBL2187886)
Ki
2400±n/a nM
Citation
 Gerritz, SWZhai, WShi, SZhu, SToyn, JHMeredith, JEIben, LGBurton, CRAlbright, CFGood, ACTebben, AJMuckelbauer, JKCamac, DMMetzler, WCook, LSPadmanabha, RLentz, KASofia, MJPoss, MAMacor, JEThompson, LA Acyl guanidine inhibitors ofß-secretase (BACE-1): optimization of a micromolar hit to a nanomolar lead via iterative solid- and solution-phase library synthesis. J Med Chem 55:9208-23 (2012)  
Target
Name:
Beta-secretase 1
Synonyms:
ASP2 Aspartyl protease 2 BACE1 Beta-secretase (BACE) Beta-secretase 1 (BACE 1) Beta-secretase 1 (BACE1) Beta-site amyloid precursor protein cleaving enzyme 1 Memapsin-2 beta-Secretase (BACE-1) | beta-Secretase (BACE1)
Type:
Protein
Mol. Mass.:
55755.10
Organism:
Homo sapiens (Human)
Description:
P56817
Residue:
501
  
Inhibitor
Name:
BDBM50398907
Synonyms:
CHEMBL2178196
Type:
Small organic molecule
Emp. Form.:
C19H15Cl2FN4O2
Mol. Mass.:
421.252
SMILES:
Cc1onc(c1C(=O)NC(N)=NCc1ccc(Cl)c(Cl)c1)-c1ccc(F)cc1
: