Target
Bombesin receptor subtype-3
Ligand
BDBM50400252
Substrate
Meas. Tech.
ChEMBL_872477 (CHEMBL2182517)
EC50
377±n/a nM
Citation
 Liu, PLanza, TJChioda, MJones, CChobanian, HRGuo, YChang, LKelly, TMKan, YPalyha, OGuan, XMMarsh, DJMetzger, JMRamsay, KWang, SPStrack, AMMiller, RPang, JLyons, KDragovic, JNing, JGSchafer, WAWelch, CJGong, XGao, YDHornak, VBall, RGTsou, NReitman, MLWyvratt, MJNargund, RPLin, LS Discovery of benzodiazepine sulfonamide-based bombesin receptor subtype 3 agonists and their unusual chirality. ACS Med Chem Lett 2:933-937 (2011)  
Target
Name:
Bombesin receptor subtype-3
Synonyms:
BRS3_MOUSE | Brs3
Type:
PROTEIN
Mol. Mass.:
44239.49
Organism:
Mus musculus
Description:
ChEMBL_1445902
Residue:
399
  
Inhibitor
Name:
BDBM50400252
Synonyms:
CHEMBL2179913
Type:
Small organic molecule
Emp. Form.:
C24H24F3N3O2S
Mol. Mass.:
475.526
SMILES:
Cc1ccc2Nc3nc(ccc3CN(c2c1)S(=O)(=O)c1ccc(cc1)C(C)(C)C)C(F)(F)F
: