Target
Replicative DNA helicase
Ligand
BDBM50400421
Substrate
Meas. Tech.
ChEMBL_877478 (CHEMBL2183632)
IC50
>100000±n/a nM
Citation
 Li, BPai, RDi, MAiello, DBarnes, MHButler, MMTashjian, TFPeet, NPBowlin, TLMoir, DT Coumarin-based inhibitors of Bacillus anthracis and Staphylococcus aureus replicative DNA helicase: chemical optimization, biological evaluation, and antibacterial activities. J Med Chem 55:10896-908 (2012)  
Target
Name:
Replicative DNA helicase
Synonyms:
BAS5321 dnaB
Type:
PROTEIN
Mol. Mass.:
50177.37
Organism:
Bacillus anthracis
Description:
ChEMBL_877478
Residue:
453
  
Inhibitor
Name:
BDBM50400421
Synonyms:
CHEMBL2178451
Type:
Small organic molecule
Emp. Form.:
C31H32N2O5
Mol. Mass.:
512.5962
SMILES:
CC(=O)NCCNC(=O)CCc1c(C)c2ccc(OCc3ccc(cc3)-c3ccccc3)c(C)c2oc1=O
: