Target
Replicative DNA helicase
Ligand
BDBM50400432
Substrate
Meas. Tech.
ChEMBL_877478 (CHEMBL2183632)
IC50
15000±n/a nM
Citation
 Li, BPai, RDi, MAiello, DBarnes, MHButler, MMTashjian, TFPeet, NPBowlin, TLMoir, DT Coumarin-based inhibitors of Bacillus anthracis and Staphylococcus aureus replicative DNA helicase: chemical optimization, biological evaluation, and antibacterial activities. J Med Chem 55:10896-908 (2012)  
Target
Name:
Replicative DNA helicase
Synonyms:
BAS5321 dnaB
Type:
PROTEIN
Mol. Mass.:
50177.37
Organism:
Bacillus anthracis
Description:
ChEMBL_877478
Residue:
453
  
Inhibitor
Name:
BDBM50400432
Synonyms:
CHEMBL2177809
Type:
Small organic molecule
Emp. Form.:
C26H22O5
Mol. Mass.:
414.4499
SMILES:
Cc1c(CCC(O)=O)c(=O)oc2cc(OCc3cccc(c3)-c3ccccc3)ccc12
: