Target
Replicative DNA helicase
Ligand
BDBM50400441
Substrate
Meas. Tech.
ChEMBL_877478 (CHEMBL2183632)
IC50
>100000±n/a nM
Citation
 Li, BPai, RDi, MAiello, DBarnes, MHButler, MMTashjian, TFPeet, NPBowlin, TLMoir, DT Coumarin-based inhibitors of Bacillus anthracis and Staphylococcus aureus replicative DNA helicase: chemical optimization, biological evaluation, and antibacterial activities. J Med Chem 55:10896-908 (2012)  
Target
Name:
Replicative DNA helicase
Synonyms:
BAS5321 dnaB
Type:
PROTEIN
Mol. Mass.:
50177.37
Organism:
Bacillus anthracis
Description:
ChEMBL_877478
Residue:
453
  
Inhibitor
Name:
BDBM50400441
Synonyms:
CHEMBL2177800
Type:
Small organic molecule
Emp. Form.:
C20H19NO5
Mol. Mass.:
353.3686
SMILES:
Cc1c(OCc2ccncc2)ccc2c(C)c(CCC(O)=O)c(=O)oc12
: