Target
Metabotropic glutamate receptor 5
Ligand
BDBM50337957
Substrate
Meas. Tech.
ChEMBL_883917 (CHEMBL2213656)
EC50
270±n/a nM
Citation
 Sheffler, DJWenthur, CJBruner, JACarrington, SJVinson, PNGogi, KKBlobaum, ALMorrison, RDVamos, MCosford, NDStauffer, SRDaniels, JSNiswender, CMConn, PJLindsley, CW Development of a novel, CNS-penetrant, metabotropic glutamate receptor 3 (mGlu3) NAM probe (ML289) derived from a closely related mGlu5 PAM. Bioorg Med Chem Lett 22:3921-5 (2012)  
Target
Name:
Metabotropic glutamate receptor 5
Synonyms:
GRM5_RAT Grm5 Mglur5 metabotropic glutamate 5/1-C metabotropic glutamate 5a
Type:
Enzyme
Mol. Mass.:
131900.14
Organism:
Rattus norvegicus (Rat)
Description:
P31424
Residue:
1203
  
Inhibitor
Name:
BDBM50337957
Synonyms:
(4-hydroxypiperidin-1-yl)(4-(phenylethynyl)phenyl)methanone | CHEMBL1684241
Type:
Small organic molecule
Emp. Form.:
C20H19NO2
Mol. Mass.:
305.3704
SMILES:
OC1CCN(CC1)C(=O)c1ccc(cc1)C#Cc1ccccc1
: