Target
Metabotropic glutamate receptor 3
Ligand
BDBM50401087
Substrate
Meas. Tech.
ChEMBL_883916 (CHEMBL2213655)
IC50
5754.4±n/a nM
Citation
 Sheffler, DJWenthur, CJBruner, JACarrington, SJVinson, PNGogi, KKBlobaum, ALMorrison, RDVamos, MCosford, NDStauffer, SRDaniels, JSNiswender, CMConn, PJLindsley, CW Development of a novel, CNS-penetrant, metabotropic glutamate receptor 3 (mGlu3) NAM probe (ML289) derived from a closely related mGlu5 PAM. Bioorg Med Chem Lett 22:3921-5 (2012)  
Target
Name:
Metabotropic glutamate receptor 3
Synonyms:
GPRC1C GRM3_HUMAN metabotropic glutamate 3 metabotropic glutamate 3/1c
Type:
Enzyme Catalytic Domain
Mol. Mass.:
98889.09
Organism:
Homo sapiens (Human)
Description:
metabotropic glutamate 1c 0 HUMAN::Q14832
Residue:
879
  
Inhibitor
Name:
BDBM50401087
Synonyms:
CHEMBL2204440
Type:
Small organic molecule
Emp. Form.:
C22H21NO4
Mol. Mass.:
363.4064
SMILES:
COc1ccc(cc1)C#Cc1ccc(cc1)C(=O)N1CCC[C@@H](C1)C(O)=O
: