Target
Metabotropic glutamate receptor 3
Ligand
BDBM50401088
Substrate
Meas. Tech.
ChEMBL_883916 (CHEMBL2213655)
IC50
2454.71±n/a nM
Citation
 Sheffler, DJWenthur, CJBruner, JACarrington, SJVinson, PNGogi, KKBlobaum, ALMorrison, RDVamos, MCosford, NDStauffer, SRDaniels, JSNiswender, CMConn, PJLindsley, CW Development of a novel, CNS-penetrant, metabotropic glutamate receptor 3 (mGlu3) NAM probe (ML289) derived from a closely related mGlu5 PAM. Bioorg Med Chem Lett 22:3921-5 (2012)  
Target
Name:
Metabotropic glutamate receptor 3
Synonyms:
GPRC1C GRM3_HUMAN metabotropic glutamate 3 metabotropic glutamate 3/1c
Type:
Enzyme Catalytic Domain
Mol. Mass.:
98889.09
Organism:
Homo sapiens (Human)
Description:
metabotropic glutamate 1c 0 HUMAN::Q14832
Residue:
879
  
Inhibitor
Name:
BDBM50401088
Synonyms:
CHEMBL2204439
Type:
Small organic molecule
Emp. Form.:
C21H21NO3
Mol. Mass.:
335.3963
SMILES:
COc1ccc(cc1)C#Cc1ccc(cc1)C(=O)N1CCCC(O)C1
: