Target
Metabotropic glutamate receptor 2
Ligand
BDBM50332963
Substrate
Meas. Tech.
ChEMBL_883913 (CHEMBL2213652)
IC50
296±n/a nM
Citation
 Sheffler, DJWenthur, CJBruner, JACarrington, SJVinson, PNGogi, KKBlobaum, ALMorrison, RDVamos, MCosford, NDStauffer, SRDaniels, JSNiswender, CMConn, PJLindsley, CW Development of a novel, CNS-penetrant, metabotropic glutamate receptor 3 (mGlu3) NAM probe (ML289) derived from a closely related mGlu5 PAM. Bioorg Med Chem Lett 22:3921-5 (2012)  
Target
Name:
Metabotropic glutamate receptor 2
Synonyms:
GPRC1B GRM2_HUMAN Metabotropic glutamate receptor mGlu2 | metabotropic glutamate 2
Type:
Enzyme
Mol. Mass.:
95584.88
Organism:
Homo sapiens (Human)
Description:
Q14416
Residue:
872
  
Inhibitor
Name:
BDBM50332963
Synonyms:
4-(3-(2,6-dimethylpyridin-4-yl)phenyl)-7-methyl-8-(trifluoromethyl)-1H-benzo[b][1,4]diazepin-2(3H)-one | CHEMBL1629855
Type:
Small organic molecule
Emp. Form.:
C24H20F3N3O
Mol. Mass.:
423.4303
SMILES:
Cc1cc(cc(C)n1)-c1cccc(c1)C1=Nc2cc(C)c(cc2NC(=O)C1)C(F)(F)F
: