Target
Cytochrome P450 2D6
Ligand
BDBM50401086
Substrate
Meas. Tech.
ChEMBL_883926 (CHEMBL2213665)
IC50
>30000±n/a nM
Citation
 Sheffler, DJWenthur, CJBruner, JACarrington, SJVinson, PNGogi, KKBlobaum, ALMorrison, RDVamos, MCosford, NDStauffer, SRDaniels, JSNiswender, CMConn, PJLindsley, CW Development of a novel, CNS-penetrant, metabotropic glutamate receptor 3 (mGlu3) NAM probe (ML289) derived from a closely related mGlu5 PAM. Bioorg Med Chem Lett 22:3921-5 (2012)  
Target
Name:
Cytochrome P450 2D6
Synonyms:
CP2D6_HUMAN CYP2DL1 Cytochrome P450 2D6 (CYP2D6) P450-DB1
Type:
Protein
Mol. Mass.:
55774.82
Organism:
Homo sapiens (Human)
Description:
P10635
Residue:
497
  
Inhibitor
Name:
BDBM50401086
Synonyms:
CHEMBL2204445
Type:
Small organic molecule
Emp. Form.:
C22H23NO3
Mol. Mass.:
349.4229
SMILES:
COc1ccc(cc1)C#Cc1ccc(cc1)C(=O)N1CCC[C@@H](CO)C1
: