Target
Metabotropic glutamate receptor 2
Ligand
BDBM50401085
Substrate
Meas. Tech.
ChEMBL_883913 (CHEMBL2213652)
IC50
>10000±n/a nM
Citation
 Sheffler, DJWenthur, CJBruner, JACarrington, SJVinson, PNGogi, KKBlobaum, ALMorrison, RDVamos, MCosford, NDStauffer, SRDaniels, JSNiswender, CMConn, PJLindsley, CW Development of a novel, CNS-penetrant, metabotropic glutamate receptor 3 (mGlu3) NAM probe (ML289) derived from a closely related mGlu5 PAM. Bioorg Med Chem Lett 22:3921-5 (2012)  
Target
Name:
Metabotropic glutamate receptor 2
Synonyms:
GPRC1B GRM2_HUMAN Metabotropic glutamate receptor mGlu2 | metabotropic glutamate 2
Type:
Enzyme
Mol. Mass.:
95584.88
Organism:
Homo sapiens (Human)
Description:
Q14416
Residue:
872
  
Inhibitor
Name:
BDBM50401085
Synonyms:
CHEMBL2204446
Type:
Small organic molecule
Emp. Form.:
C22H23NO3
Mol. Mass.:
349.4229
SMILES:
COc1ccc(cc1)C#Cc1ccc(cc1)C(=O)N1CCC[C@H](CO)C1
: