Target
Phosphatidylinositol 4,5-bisphosphate 3-kinase catalytic subunit gamma isoform
Ligand
BDBM50402263
Substrate
Meas. Tech.
ChEMBL_885411 (CHEMBL2216152)
IC50
223±n/a nM
Citation
 Oka, YYabuuchi, TFujii, YOhtake, HWakahara, SMatsumoto, KEndo, MTamura, YSekiguchi, Y Discovery and optimization of a series of 2-aminothiazole-oxazoles as potent phosphoinositide 3-kinase¿ inhibitors. Bioorg Med Chem Lett 22:7534-8 (2012)  
Target
Name:
Phosphatidylinositol 4,5-bisphosphate 3-kinase catalytic subunit gamma isoform
Synonyms:
PI3-kinase p110 subunit gamma PI3Kgamma PK3CG_HUMAN Phosphatidylinositol 4,5-bisphosphate 3-kinase (PI3K) Phosphatidylinositol 4,5-bisphosphate 3-kinase catalytic subunit gamma (PI3Kgamma) Phosphatidylinositol 4,5-bisphosphate 3-kinase catalytic subunit gamma isoform (PI3K) Phosphatidylinositol-4,5-bisphosphate 3-kinase catalytic subunit gamma isoform Phosphoinositide 3-kinases gamma (PI3K gamma) p120-PI3K
Type:
Enzyme Subunit
Mol. Mass.:
126470.30
Organism:
Homo sapiens (Human)
Description:
P48736
Residue:
1102
  
Inhibitor
Name:
BDBM50402263
Synonyms:
CHEMBL2204780
Type:
Small organic molecule
Emp. Form.:
C17H15N3O4S
Mol. Mass.:
357.384
SMILES:
CC(=O)Nc1nc(C)c(s1)-c1cnc(Cc2cccc(c2)C(O)=O)o1
: