Target
Phosphatidylinositol 4,5-bisphosphate 3-kinase catalytic subunit gamma isoform
Ligand
BDBM50402266
Substrate
Meas. Tech.
ChEMBL_885414 (CHEMBL2216155)
IC50
222±n/a nM
Citation
 Oka, YYabuuchi, TFujii, YOhtake, HWakahara, SMatsumoto, KEndo, MTamura, YSekiguchi, Y Discovery and optimization of a series of 2-aminothiazole-oxazoles as potent phosphoinositide 3-kinase¿ inhibitors. Bioorg Med Chem Lett 22:7534-8 (2012)  
Target
Name:
Phosphatidylinositol 4,5-bisphosphate 3-kinase catalytic subunit gamma isoform
Synonyms:
PI3-kinase subunit gamma PI3Kgamma Phosphatidylinositol 3-kinase p110γ (p110γ) Phosphatidylinositol 4,5-bisphosphate 3-kinase catalytic subunit gamma isoform Pi3kg1 PtdIns-3-kinase subunit gamma Serine/threonine protein kinase PIK3CG p120-PI3K
Type:
Enzyme
Mol. Mass.:
126411.77
Organism:
Mus musculus (Mouse)
Description:
Q9JHG7
Residue:
1102
  
Inhibitor
Name:
BDBM50402266
Synonyms:
CHEMBL2204778
Type:
Small organic molecule
Emp. Form.:
C10H11N3O4S2
Mol. Mass.:
301.342
SMILES:
CC(=O)Nc1nc(C)c(s1)-c1cnc(o1)S(C)(=O)=O
: