Target
Phosphatidylinositol 4,5-bisphosphate 3-kinase catalytic subunit gamma isoform
Ligand
BDBM50402270
Substrate
Meas. Tech.
ChEMBL_885411 (CHEMBL2216152)
IC50
46±n/a nM
Citation
 Oka, YYabuuchi, TFujii, YOhtake, HWakahara, SMatsumoto, KEndo, MTamura, YSekiguchi, Y Discovery and optimization of a series of 2-aminothiazole-oxazoles as potent phosphoinositide 3-kinase¿ inhibitors. Bioorg Med Chem Lett 22:7534-8 (2012)  
Target
Name:
Phosphatidylinositol 4,5-bisphosphate 3-kinase catalytic subunit gamma isoform
Synonyms:
PI3-kinase p110 subunit gamma PI3Kgamma PK3CG_HUMAN Phosphatidylinositol 4,5-bisphosphate 3-kinase (PI3K) Phosphatidylinositol 4,5-bisphosphate 3-kinase catalytic subunit gamma (PI3Kgamma) Phosphatidylinositol 4,5-bisphosphate 3-kinase catalytic subunit gamma isoform (PI3K) Phosphatidylinositol-4,5-bisphosphate 3-kinase catalytic subunit gamma isoform Phosphoinositide 3-kinases gamma (PI3K gamma) p120-PI3K
Type:
Enzyme Subunit
Mol. Mass.:
126470.30
Organism:
Homo sapiens (Human)
Description:
P48736
Residue:
1102
  
Inhibitor
Name:
BDBM50402270
Synonyms:
CHEMBL2204792
Type:
Small organic molecule
Emp. Form.:
C11H14N4O2S
Mol. Mass.:
266.319
SMILES:
CN(C)c1ncc(o1)-c1sc(NC(C)=O)nc1C
: