Target
Muscarinic acetylcholine receptor M3
Ligand
BDBM50408527
Substrate
Meas. Tech.
ChEMBL_138975 (CHEMBL857564)
Ki
115±n/a nM
Citation
 Bolognesi, MLMinarini, ABudriesi, RCacciaguerra, SChiarini, ASpampinato, STumiatti, VMelchiorre, C Universal template approach to drug design: polyamines as selective muscarinic receptor antagonists. J Med Chem 41:4150-60 (1998)  
Target
Name:
Muscarinic acetylcholine receptor M3
Synonyms:
ACM3_RAT Chrm-3 | Chrm3
Type:
Enzyme Catalytic Domain
Mol. Mass.:
66086.66
Organism:
RAT
Description:
Cholinergic, muscarinic M3 CHRM3 RAT::P08483
Residue:
589
  
Inhibitor
Name:
BDBM50408527
Synonyms:
CHEMBL1202004
Type:
Small organic molecule
Emp. Form.:
C52H70N8O4
Mol. Mass.:
871.1634
SMILES:
CN(CCCCCCCCN(C)CCCCCCNCC(=O)N1c2ccccc2NC(=O)c2ccccc12)CCCCCCNCC(=O)N1c2ccccc2NC(=O)c2ccccc12
: