Target
Muscarinic acetylcholine receptor M4
Ligand
BDBM50408527
Substrate
Meas. Tech.
ChEMBL_139256 (CHEMBL745529)
Ki
2.8±n/a nM
Citation
 Bolognesi, MLMinarini, ABudriesi, RCacciaguerra, SChiarini, ASpampinato, STumiatti, VMelchiorre, C Universal template approach to drug design: polyamines as selective muscarinic receptor antagonists. J Med Chem 41:4150-60 (1998)  
Target
Name:
Muscarinic acetylcholine receptor M4
Synonyms:
ACM4_RAT Chrm-4 | Chrm4
Type:
Enzyme Catalytic Domain
Mol. Mass.:
52841.70
Organism:
RAT
Description:
Cholinergic, muscarinic M4 CHRM4 RAT::P08485
Residue:
477
  
Inhibitor
Name:
BDBM50408527
Synonyms:
CHEMBL1202004
Type:
Small organic molecule
Emp. Form.:
C52H70N8O4
Mol. Mass.:
871.1634
SMILES:
CN(CCCCCCCCN(C)CCCCCCNCC(=O)N1c2ccccc2NC(=O)c2ccccc12)CCCCCCNCC(=O)N1c2ccccc2NC(=O)c2ccccc12
: