Target
T-cell surface glycoprotein CD4
Ligand
BDBM50036146
Substrate
Meas. Tech.
ChEMBL_101473 (CHEMBL712351)
EC50
4000±n/a nM
Citation
 Santhosh, KCPaul, GCDe Clercq, EPannecouque, CWitvrouw, MLoftus, TLTurpin, JABuckheit, RWCushman, M Correlation of anti-HIV activity with anion spacing in a series of cosalane analogues with extended polycarboxylate pharmacophores. J Med Chem 44:703-14 (2001)  
Target
Name:
T-cell surface glycoprotein CD4
Synonyms:
CD4 CD_antigen=CD4 T-cell surface antigen T4/Leu-3 | T-cell surface glycoprotein CD4
Type:
PROTEIN
Mol. Mass.:
51136.66
Organism:
Homo sapiens (Human)
Description:
ChEMBL_440402
Residue:
458
  
Inhibitor
Name:
BDBM50036146
Synonyms:
5-{1-(3-carboxy-5-chloro-4-hydroxyphenyl)-4-[1-(1,5-dimethylhexyl)-9a,11a-dimethyl-(7S,9aS,11aR)-perhydrocyclopenta[a]phenanthren-7-yl]-1-butenyl}-3-chloro-2-hydroxybenzoic acid 5-{1-(3-carboxy-5-chloro-4-hydroxyphenyl)-4-[1-(1,5-dimethylhexyl)-9a,11a-dimethylperhydrocyclopenta[a]phenanthren-7-yl]-1-butenyl}-3-chloro-2-hydroxybenzoic acid 5-{1-(3-carboxy-5-chloro-4-hydroxyphenyl-4-[1-(1,5-dimethylhexyl)-9a,11a-dimethylperhydrocyclopenta[a]phenanthren-7-yl]-1-butenyl}-3-chloro-2-hydroxy acetic acid (Cosalane) Cosalane
Type:
Small organic molecule
Emp. Form.:
C45H60Cl2O6
Mol. Mass.:
767.86
SMILES:
[#6]-[#6](-[#6])-[#6]-[#6]-[#6]-[#6](-[#6])-[#6@H]1-[#6]-[#6]-[#6]2-[#6]-3-[#6]-[#6]-[#6]4-[#6]-[#6@@H](-[#6]-[#6]\[#6]=[#6](\c5cc(Cl)c(-[#8])c(c5)-[#6](-[#8])=O)-c5cc(Cl)c(-[#8])c(c5)-[#6](-[#8])=O)-[#6]-[#6][C@]4([#6])[#6]-3-[#6]-[#6][C@]12[#6]
: