Target
T-cell surface glycoprotein CD4
Ligand
BDBM50092094
Substrate
Meas. Tech.
ChEMBL_101473 (CHEMBL712351)
EC50
>100000±n/a nM
Citation
 Santhosh, KCPaul, GCDe Clercq, EPannecouque, CWitvrouw, MLoftus, TLTurpin, JABuckheit, RWCushman, M Correlation of anti-HIV activity with anion spacing in a series of cosalane analogues with extended polycarboxylate pharmacophores. J Med Chem 44:703-14 (2001)  
Target
Name:
T-cell surface glycoprotein CD4
Synonyms:
CD4 CD_antigen=CD4 T-cell surface antigen T4/Leu-3 | T-cell surface glycoprotein CD4
Type:
PROTEIN
Mol. Mass.:
51136.66
Organism:
Homo sapiens (Human)
Description:
ChEMBL_440402
Residue:
458
  
Inhibitor
Name:
BDBM50092094
Synonyms:
3'',3'''-Dichloro-5'',5'''-dicarboxy-4'',4'''-di[p-(4-carboxy-phenyl)benzyloxy]-4',4'-diphenyl-3beta-(3'-buten-1-yl)cholestane CHEMBL413974
Type:
Small organic molecule
Emp. Form.:
C73H80Cl2O10
Mol. Mass.:
1188.316
SMILES:
[#6]-[#6](-[#6])-[#6]-[#6]-[#6]-[#6](-[#6])-[#6@H]1-[#6]-[#6]-[#6]2-[#6]-3-[#6]-[#6]-[#6]4-[#6]-[#6@@H](-[#6]-[#6]\[#6]=[#6](/c5cc(Cl)c(-[#8]-[#6]-c6ccc(cc6)-c6ccc(cc6)-[#6](-[#8])=O)c(c5)-[#6](-[#8])=O)-c5cc(Cl)c(-[#8]-[#6]-c6ccc(cc6)-c6ccc(cc6)-[#6](-[#8])=O)c(c5)-[#6](-[#8])=O)-[#6]-[#6][C@]4([#6])[#6]-3-[#6]-[#6][C@]12[#6]
: