Target
Muscarinic acetylcholine receptor M1
Ligand
BDBM50413109
Substrate
Meas. Tech.
ChEMBL_496879 (CHEMBL998548)
Kd
2.51±n/a nM
Citation
 Jin, JWang, YShi, DWang, FFu, WDavis, RSJin, QFoley, JJSarau, HMMorrow, DMMoore, MLRivero, RAPalovich, MSalmon, MBelmonte, KEBusch-Petersen, J Muscarinic acetylcholine receptor antagonists: SAR and optimization of tyrosine ureas. Bioorg Med Chem Lett 18:5481-6 (2008)  
Target
Name:
Muscarinic acetylcholine receptor M1
Synonyms:
ACM1_HUMAN Cholinergic receptor, muscarinic 1 | Cholinergic, muscarinic M1
Type:
Protein
Mol. Mass.:
51442.54
Organism:
Homo sapiens (Human)
Description:
P11229
Residue:
460
  
Inhibitor
Name:
BDBM50413109
Synonyms:
CHEMBL553448
Type:
Small organic molecule
Emp. Form.:
C34H43N4O6S
Mol. Mass.:
635.793
SMILES:
C[N+]1(Cc2ccc(O)cc2)CCC[C@@H](C1)NC(=O)[C@H](Cc1ccc(O)cc1)NC(=O)Nc1ccc(s1)C(=O)OC1CCCCC1
: