Target
Cannabinoid receptor 2
Ligand
BDBM50418012
Substrate
Meas. Tech.
ChEMBL_728038 (CHEMBL1686909)
Ki
6.31±n/a nM
Citation
 Kiyoi, TAdam, JMClark, JKDavies, KEasson, AMEdwards, DFeilden, HFields, RFrancis, SJeremiah, FMcArthur, DMorrison, AJProsser, ARatcliffe, PDSchulz, JWishart, GBaker, JCampbell, RCottney, JEDeehan, MEpemolu, OEvans, L Discovery of potent and orally bioavailable heterocycle-based cannabinoid CB1 receptor agonists. Bioorg Med Chem Lett 21:1748-53 (2011)  
Target
Name:
Cannabinoid receptor 2
Synonyms:
CANNABINOID CB2 CB2 CB2B CNR2_HUMAN Cannabinoid CB2 receptor Cannabinoid receptor 2 (CB2R) | hCB2
Type:
G Protein-Coupled Receptor (GPCR)
Mol. Mass.:
39690.94
Organism:
Homo sapiens (Human)
Description:
P34972
Residue:
360
  
Inhibitor
Name:
BDBM50418012
Synonyms:
CHEMBL1682272
Type:
Small organic molecule
Emp. Form.:
C20H24ClN5O3
Mol. Mass.:
417.889
SMILES:
CN(CC(N)=O)Cc1nc(no1)-c1cn(CC2CCOCC2)c2c(Cl)cccc12
: