Target
5-hydroxytryptamine receptor 6
Ligand
BDBM50419052
Substrate
Meas. Tech.
ChEMBL_766683 (CHEMBL1827377)
Ki
0.776±n/a nM
Citation
 Liu, FMajo, VJPrabhakaran, JMilak, MSJohn Mann, JParsey, RVKumar, JS Synthesis and in vivo evaluation of [O-methyl-11C] N-[3,5-dichloro-2-(methoxy)phenyl]-4-(methoxy)-3-(1-piperazinyl)benzenesulfonamide as an imaging probe for 5-HT6 receptors. Bioorg Med Chem 19:5255-9 (2011)  
Target
Name:
5-hydroxytryptamine receptor 6
Synonyms:
5-HT-6 5-hydroxytryptamine receptor 6 (5-HT-6) 5-hydroxytryptamine receptor 6 (5HT6) HTR6 Serotonin 6 (5-HT6) receptor | Serotonin Receptor 6
Type:
G Protein-Coupled Receptor (GPCR)
Mol. Mass.:
46968.43
Organism:
Homo sapiens (Human)
Description:
P50406
Residue:
440
  
Inhibitor
Name:
BDBM50419052
Synonyms:
SB-399885
Type:
Small organic molecule
Emp. Form.:
C18H21Cl2N3O4S
Mol. Mass.:
446.348
SMILES:
COc1ccc(cc1N1CCNCC1)S(=O)(=O)Nc1cc(Cl)cc(Cl)c1OC
: