Target
Solute carrier family 22 member 2
Ligand
BDBM50420192
Substrate
Meas. Tech.
ChEMBL_836433 (CHEMBL2076873)
Ki
861±n/a nM
Citation
 Pan, BFSweet, DHPritchard, JBChen, RNelson, JA A transfected cell model for the renal toxin transporter, rOCT2. Toxicol Sci 47:181-6 (1999)  
Target
Name:
Solute carrier family 22 member 2
Synonyms:
Adrenaline alpha2 Organic cation transporter 2 Slc22a2 rOCT2
Type:
Enzyme Catalytic Domain
Mol. Mass.:
62348.38
Organism:
RAT
Description:
Adrenaline alpha2 0 RAT::Q9R0W2
Residue:
555
  
Inhibitor
Name:
BDBM50420192
Synonyms:
CHEMBL2074851
Type:
Small organic molecule
Emp. Form.:
C24H26N3
Mol. Mass.:
356.4828
SMILES:
CC[n+]1c(CC2C=C(C)N=C(N2C)c2ccccc2)ccc2ccccc12
: