Target
Cyclin-dependent kinase 6/G1/S-specific cyclin-D3
Ligand
BDBM50420304
Substrate
Meas. Tech.
ChEMBL_839770 (CHEMBL2089692)
IC50
26±n/a nM
Citation
 Cho, YSAngove, HBrain, CChen, CHCheng, HCheng, RChopra, RChung, KCongreve, MDagostin, CDavis, DJFeltell, RGiraldes, JHiscock, SDKim, SKovats, SLagu, BLewry, KLoo, ALu, YLuzzio, MManiara, WMcMenamin, RMortenson, PNBenning, RRees, DCShen, JSmith, TWang, YWilliams, GWoolford, AJWrona, WXu, MYang, FHoward, S Fragment-Based Discovery of 7-Azabenzimidazoles as Potent, Highly Selective, and Orally Active CDK4/6 Inhibitors. ACS Med Chem Lett 3:445-449 (2012)  
Target
Name:
Cyclin-dependent kinase 6/G1/S-specific cyclin-D3
Synonyms:
CDK6/CycD3 CDK6/G1/S-specific cyclin D3 Cyclin-dependent kinase 6 | Cyclin-dependent kinase 6/G1/S-specific cyclin D3
Type:
Protein
Mol. Mass.:
Description:
Components:
This complex has 2 components.
Component 1
Name:
Cyclin-dependent kinase 6
Synonyms:
CDK6 CDKN6 Cyclin-dependent kinase 6 (CDK 6) | Serine/threonine-protein kinase PLSTIRE
Type:
Enzyme Subunit
Mol. Mass.:
36937.42
Organism:
Homo sapiens (Human)
Description:
Q00534
Residue:
326
  
Component 2
Name:
G1/S-specific cyclin-D3
Synonyms:
CCND3 | CCND3_HUMAN
Type:
Enzyme
Mol. Mass.:
32521.90
Organism:
Homo sapiens (Human)
Description:
P30281
Residue:
292
  
Inhibitor
Name:
BDBM50420304
Synonyms:
CHEMBL2089065 | US8598217, 165
Type:
Small organic molecule
Emp. Form.:
C30H27N7O
Mol. Mass.:
501.5817
SMILES:
CN(C)C1CCN(CC1)c1ccc2[nH]c(nc2n1)C(=O)c1ccc(C#N)c(c1)-c1cncc2ccccc12
: