Target
Cathepsin B-like cysteine protease
Ligand
BDBM50421232
Substrate
Meas. Tech.
ChEMBL_840092 (CHEMBL2090696)
IC50
43000±n/a nM
Citation
 Lavrado, JMackey, ZHansell, EMcKerrow, JHPaulo, AMoreira, R Antitrypanosomal and cysteine protease inhibitory activities of alkyldiamine cryptolepine derivatives. Bioorg Med Chem Lett 22:6256-60 (2012)  
Target
Name:
Cathepsin B-like cysteine protease
Synonyms:
CPC Cysteine peptidase C | TbcatB
Type:
Enzyme
Mol. Mass.:
37220.37
Organism:
Trypanosoma brucei
Description:
Enzyme was expressed in yeast Pichia pastoris.
Residue:
340
  
Inhibitor
Name:
BDBM50421232
Synonyms:
CHEMBL1289050
Type:
Small organic molecule
Emp. Form.:
C21H21Cl2N4
Mol. Mass.:
400.324
SMILES:
Cn1c2c([nH+]c3cc(Cl)ccc23)c(NC2CCNCC2)c2ccc(Cl)cc12
: