Target
Cathepsin B-like cysteine protease
Ligand
BDBM50421235
Substrate
Meas. Tech.
ChEMBL_840092 (CHEMBL2090696)
IC50
64000±n/a nM
Citation
 Lavrado, JMackey, ZHansell, EMcKerrow, JHPaulo, AMoreira, R Antitrypanosomal and cysteine protease inhibitory activities of alkyldiamine cryptolepine derivatives. Bioorg Med Chem Lett 22:6256-60 (2012)  
Target
Name:
Cathepsin B-like cysteine protease
Synonyms:
CPC Cysteine peptidase C | TbcatB
Type:
Enzyme
Mol. Mass.:
37220.37
Organism:
Trypanosoma brucei
Description:
Enzyme was expressed in yeast Pichia pastoris.
Residue:
340
  
Inhibitor
Name:
BDBM50421235
Synonyms:
CHEMBL1290718
Type:
Small organic molecule
Emp. Form.:
C23H28ClN4
Mol. Mass.:
395.948
SMILES:
CCN(CC)CCCNc1c2[nH+]c3ccccc3c2n(C)c2cc(Cl)ccc12
: