Target
Cathepsin B-like cysteine protease
Ligand
BDBM50421236
Substrate
Meas. Tech.
ChEMBL_840092 (CHEMBL2090696)
IC50
59000±n/a nM
Citation
 Lavrado, JMackey, ZHansell, EMcKerrow, JHPaulo, AMoreira, R Antitrypanosomal and cysteine protease inhibitory activities of alkyldiamine cryptolepine derivatives. Bioorg Med Chem Lett 22:6256-60 (2012)  
Target
Name:
Cathepsin B-like cysteine protease
Synonyms:
CPC Cysteine peptidase C | TbcatB
Type:
Enzyme
Mol. Mass.:
37220.37
Organism:
Trypanosoma brucei
Description:
Enzyme was expressed in yeast Pichia pastoris.
Residue:
340
  
Inhibitor
Name:
BDBM50421236
Synonyms:
CHEMBL1290717
Type:
Small organic molecule
Emp. Form.:
C21H17N4
Mol. Mass.:
325.3859
SMILES:
Cn1c2c3ccccc3[nH+]c2c(Nc2cccnc2)c2ccccc12
: