Target
Cathepsin B-like cysteine protease
Ligand
BDBM50421237
Substrate
Meas. Tech.
ChEMBL_840092 (CHEMBL2090696)
IC50
59000±n/a nM
Citation
 Lavrado, JMackey, ZHansell, EMcKerrow, JHPaulo, AMoreira, R Antitrypanosomal and cysteine protease inhibitory activities of alkyldiamine cryptolepine derivatives. Bioorg Med Chem Lett 22:6256-60 (2012)  
Target
Name:
Cathepsin B-like cysteine protease
Synonyms:
CPC Cysteine peptidase C | TbcatB
Type:
Enzyme
Mol. Mass.:
37220.37
Organism:
Trypanosoma brucei
Description:
Enzyme was expressed in yeast Pichia pastoris.
Residue:
340
  
Inhibitor
Name:
BDBM50421237
Synonyms:
CHEMBL1290599
Type:
Small organic molecule
Emp. Form.:
C27H29N4O
Mol. Mass.:
425.5448
SMILES:
CCN(CC)Cc1ccc(Nc2c3[nH+]c4ccccc4c3n(C)c3ccccc23)cc1O
: