Target
Cathepsin B-like cysteine protease
Ligand
BDBM50264501
Substrate
Meas. Tech.
ChEMBL_840092 (CHEMBL2090696)
IC50
97000±n/a nM
Citation
 Lavrado, JMackey, ZHansell, EMcKerrow, JHPaulo, AMoreira, R Antitrypanosomal and cysteine protease inhibitory activities of alkyldiamine cryptolepine derivatives. Bioorg Med Chem Lett 22:6256-60 (2012)  
Target
Name:
Cathepsin B-like cysteine protease
Synonyms:
CPC Cysteine peptidase C | TbcatB
Type:
Enzyme
Mol. Mass.:
37220.37
Organism:
Trypanosoma brucei
Description:
Enzyme was expressed in yeast Pichia pastoris.
Residue:
340
  
Inhibitor
Name:
BDBM50264501
Synonyms:
CHEMBL253715 N-(5-N-Methyl-10H-indolo[3,2-b]quinolin-5-ium)-N,N-diethyl-propane-1,3-diamine Iodide
Type:
Small organic molecule
Emp. Form.:
C23H29N4
Mol. Mass.:
361.5026
SMILES:
CCN(CC)CCCNc1c2[nH+]c3ccccc3c2n(C)c2ccccc12
: