Target
Cathepsin B-like cysteine protease
Ligand
BDBM50421251
Substrate
Meas. Tech.
ChEMBL_840092 (CHEMBL2090696)
IC50
>100000±n/a nM
Citation
 Lavrado, JMackey, ZHansell, EMcKerrow, JHPaulo, AMoreira, R Antitrypanosomal and cysteine protease inhibitory activities of alkyldiamine cryptolepine derivatives. Bioorg Med Chem Lett 22:6256-60 (2012)  
Target
Name:
Cathepsin B-like cysteine protease
Synonyms:
CPC Cysteine peptidase C | TbcatB
Type:
Enzyme
Mol. Mass.:
37220.37
Organism:
Trypanosoma brucei
Description:
Enzyme was expressed in yeast Pichia pastoris.
Residue:
340
  
Inhibitor
Name:
BDBM50421251
Synonyms:
CHEMBL267856
Type:
Small organic molecule
Emp. Form.:
C21H25N4
Mol. Mass.:
333.4495
SMILES:
CC(CN(C)C)Nc1c2[nH+]c3ccccc3c2n(C)c2ccccc12
: