Target
Integrin alpha-4/beta-1
Ligand
BDBM50114300
Substrate
Meas. Tech.
ChEMBL_213382 (CHEMBL818165)
IC50
50±n/a nM
Citation
 Porter, JRArchibald, SCBrown, JAChilds, KCritchley, DHead, JCHutchinson, BParton, TARobinson, MKShock, AWarrellow, GJZomaya, A N-(pyrimidin-4-yl) and N-(pyridin-2-yl) phenylalanine derivatives as VLA-4 integrin antagonists. Bioorg Med Chem Lett 12:1595-8 (2002)  
Target
Name:
Integrin alpha-4/beta-1
Synonyms:
Fibronectin receptor beta/Integrin alpha-4 | Integrin alpha-4/beta-1
Type:
Mol. Mass.:
Description:
ASSAY_ID of EBI is 88912
Components:
This complex has 2 components.
Component 1
Name:
Integrin beta-1
Synonyms:
CD_antigen=CD29 Fibronectin receptor beta GPIIA ITGB1 MDF2 | MSK12
Type:
Enzyme
Mol. Mass.:
88400.38
Organism:
Homo sapiens (Human)
Description:
P05556
Residue:
798
  
Component 2
Name:
Integrin alpha-4
Synonyms:
CD49 antigen-like family member D CD49d antigen ITA4_HUMAN Integrin alpha-4 Integrin alpha-IV VLA-4 integrin alpha 4 precursor | integrin alpha-4 precursor
Type:
Membrane Protein
Mol. Mass.:
114897.35
Organism:
Homo sapiens (Human)
Description:
P13612
Residue:
1032
  
Inhibitor
Name:
BDBM50114300
Synonyms:
3-{4-[(3,5-Dichloro-pyridine-4-carbonyl)-amino]-phenyl}-2-[4-(propane-1-sulfonyl)-pyridin-2-ylamino]-propionic acid | CHEMBL41179
Type:
Small organic molecule
Emp. Form.:
C23H22Cl2N4O5S
Mol. Mass.:
537.416
SMILES:
CCCS(=O)(=O)c1ccnc(NC(Cc2ccc(NC(=O)c3c(Cl)cncc3Cl)cc2)C(O)=O)c1
: