Target
Integrin alpha-5/beta-1
Ligand
BDBM50423731
Substrate
Meas. Tech.
ChEMBL_603785 (CHEMBL1042923)
IC50
351±n/a nM
Citation
 Zischinsky, GOsterkamp, FVossmeyer, DZahn, GScharn, DZwintscher, AStragies, R SAR of N-phenyl piperidine based oral integrin alpha5beta1 antagonists. Bioorg Med Chem Lett 20:65-8 (2010)  
Target
Name:
Integrin alpha-5/beta-1
Synonyms:
Fibronectin receptor alpha/beta ITGA5/ITGB1
Type:
Enzyme
Mol. Mass.:
Description:
Components:
This complex has 2 components.
Component 1
Name:
Integrin alpha-5
Synonyms:
CD49 antigen-like family member E FNRA Fibronectin receptor subunit alpha ITGA5 Integrin alpha-F | VLA-5
Type:
Single-pass type I membrane protein
Mol. Mass.:
114523.00
Organism:
Homo sapiens (Human)
Description:
Residue:
1049
  
Component 2
Name:
Integrin beta-1
Synonyms:
CD_antigen=CD29 Fibronectin receptor beta GPIIA ITGB1 MDF2 | MSK12
Type:
Enzyme
Mol. Mass.:
88400.38
Organism:
Homo sapiens (Human)
Description:
P05556
Residue:
798
  
Inhibitor
Name:
BDBM50423731
Synonyms:
CHEMBL590622
Type:
Small organic molecule
Emp. Form.:
C30H35FN4O3
Mol. Mass.:
518.6223
SMILES:
CCc1cc(F)cc(C)c1C(=O)N[C@H](Cc1ccc(cc1)N1CCC(CNc2ccccn2)CC1)C(O)=O
: