Target
Integrin alpha-V/beta-3
Ligand
BDBM50423731
Substrate
Meas. Tech.
ChEMBL_603786 (CHEMBL1042924)
IC50
16600±n/a nM
Citation
 Zischinsky, GOsterkamp, FVossmeyer, DZahn, GScharn, DZwintscher, AStragies, R SAR of N-phenyl piperidine based oral integrin alpha5beta1 antagonists. Bioorg Med Chem Lett 20:65-8 (2010)  
Target
Name:
Integrin alpha-V/beta-3
Synonyms:
ITGAV/ITGB3 | Integrin beta-3/Vitronectin receptor alpha
Type:
Enzyme
Mol. Mass.:
Description:
Components:
This complex has 2 components.
Component 1
Name:
Integrin alpha-V
Synonyms:
ITAV_HUMAN Integrin alpha-V/alpha-5 VNRA Vitronectin receptor | Vitronectin receptor subunit alpha
Type:
PROTEIN
Mol. Mass.:
116024.92
Organism:
Homo sapiens (Human)
Description:
ChEMBL_582336
Residue:
1048
  
Component 2
Name:
Integrin beta-3
Synonyms:
CD_antigen=CD61 GPIIIa ITGB3 Platelet membrane glycoprotein IIIa
Type:
Protein
Mol. Mass.:
87038.91
Organism:
Homo sapiens (Human)
Description:
P05106
Residue:
788
  
Inhibitor
Name:
BDBM50423731
Synonyms:
CHEMBL590622
Type:
Small organic molecule
Emp. Form.:
C30H35FN4O3
Mol. Mass.:
518.6223
SMILES:
CCc1cc(F)cc(C)c1C(=O)N[C@H](Cc1ccc(cc1)N1CCC(CNc2ccccn2)CC1)C(O)=O
: