Target
Integrin alpha-IIb/beta-3
Ligand
BDBM50423731
Substrate
Meas. Tech.
ChEMBL_603788 (CHEMBL1042926)
IC50
159000±n/a nM
Citation
 Zischinsky, GOsterkamp, FVossmeyer, DZahn, GScharn, DZwintscher, AStragies, R SAR of N-phenyl piperidine based oral integrin alpha5beta1 antagonists. Bioorg Med Chem Lett 20:65-8 (2010)  
Target
Name:
Integrin alpha-IIb/beta-3
Synonyms:
Glycoprotein IIb/IIIa
Type:
Mol. Mass.:
Description:
ASSAY_ID of EBI is 30109
Components:
This complex has 2 components.
Component 1
Name:
Integrin beta-3
Synonyms:
CD_antigen=CD61 GPIIIa ITGB3 Platelet membrane glycoprotein IIIa
Type:
Protein
Mol. Mass.:
87038.91
Organism:
Homo sapiens (Human)
Description:
P05106
Residue:
788
  
Component 2
Name:
Integrin alpha-IIb
Synonyms:
CD_antigen=CD41 GPIIb Glycoprotein IIb ITGA2B Integrin alpha-IIb heavy chain Integrin alpha-IIb light chain, form 2 Integrin alpha-V/beta-3 and alpha-IIb/beta 3 | Platelet membrane glycoprotein IIb
Type:
Protein
Mol. Mass.:
113354.85
Organism:
Homo sapiens (Human)
Description:
P08514
Residue:
1039
  
Inhibitor
Name:
BDBM50423731
Synonyms:
CHEMBL590622
Type:
Small organic molecule
Emp. Form.:
C30H35FN4O3
Mol. Mass.:
518.6223
SMILES:
CCc1cc(F)cc(C)c1C(=O)N[C@H](Cc1ccc(cc1)N1CCC(CNc2ccccn2)CC1)C(O)=O
: