Target
Tyrosine-protein kinase receptor TYRO3
Ligand
BDBM50425863
Substrate
Meas. Tech.
ChEMBL_933985 (CHEMBL2318063)
IC50
10.0±n/a nM
Citation
 Powell, NAHoffman, JKCiske, FLKohrt, JTBaxi, SMPeng, YWZhong, MCatana, COhren, JPerrin, LAEdmunds, JJ Optimization of highly selective 2,4-diaminopyrimidine-5-carboxamide inhibitors of Sky kinase. Bioorg Med Chem Lett 23:1051-5 (2013)  
Target
Name:
Tyrosine-protein kinase receptor TYRO3
Synonyms:
BYK RSE TIF TYRO3_HUMAN | Tyrosine-protein kinase SKY
Type:
Protein
Mol. Mass.:
96894.13
Organism:
Homo sapiens (Human)
Description:
Q06418
Residue:
890
  
Inhibitor
Name:
BDBM50425863
Synonyms:
CHEMBL2312652
Type:
Small organic molecule
Emp. Form.:
C21H26Cl2N6O3
Mol. Mass.:
481.376
SMILES:
CN1CCC(CC1)NC(=O)c1cnc(Nc2cc(Cl)cc(Cl)c2)nc1N[C@@H]1COC[C@H]1O
: