Target
Metabotropic glutamate receptor 5
Ligand
BDBM50429060
Substrate
Meas. Tech.
ChEMBL_943155 (CHEMBL2345731)
IC50
940±n/a nM
Citation
 Son, MHKim, JYLim, EJBaek, DJChoi, KLee, JKPae, ANMin, SJCho, YS Synthesis and biological evaluation of 2-(arylethynyl)quinoline derivatives as mGluR5 antagonists for the treatment of neuropathic pain. Bioorg Med Chem Lett 23:1472-6 (2013)  
Target
Name:
Metabotropic glutamate receptor 5
Synonyms:
GPRC1E GRM5_HUMAN metabotropic glutamate 5 | metabotropic glutamate 5a
Type:
Enzyme
Mol. Mass.:
132484.72
Organism:
Homo sapiens (Human)
Description:
Residue:
1212
  
Inhibitor
Name:
BDBM50429060
Synonyms:
CHEMBL2335291
Type:
Small organic molecule
Emp. Form.:
C16H10N2
Mol. Mass.:
230.264
SMILES:
c1ccc(nc1)C#Cc1ccc2ccccc2n1
: