Target
Diacylglycerol O-acyltransferase 1
Ligand
BDBM50437756
Substrate
Meas. Tech.
ChEMBL_973380 (CHEMBL2410086)
IC50
330±n/a nM
Citation
 Kwak, HJPyun, YMKim, JYPagire, HSKim, KYKim, KRRhee, SDJung, WHSong, JSBae, MALee, DHAhn, JH Synthesis and biological evaluation of aminobenzimidazole derivatives with a phenylcyclohexyl acetic acid group as anti-obesity and anti-diabetic agents. Bioorg Med Chem Lett 23:4713-8 (2013)  
Target
Name:
Diacylglycerol O-acyltransferase 1
Synonyms:
ACAT-related gene product 1 Acyl coA-diacylglycerol acyl transferase 1 (DGAT1) DGAT1 Diacylglycerol Acyltransferase (DGAT1) Diacylglycerol O-acyltransferase 1 (DGAT1) | Diglyceride acyltransferase
Type:
Protein
Mol. Mass.:
55297.82
Organism:
Homo sapiens (Human)
Description:
O75907
Residue:
488
  
Inhibitor
Name:
BDBM50437756
Synonyms:
CHEMBL2409560
Type:
Small organic molecule
Emp. Form.:
C34H31N3O3
Mol. Mass.:
529.6282
SMILES:
OC(=O)CC1CCC(CC1)c1ccc(cc1)-c1nc2ccc(NC(=O)c3ccc(cc3)-c3ccccc3)cc2[nH]1
: