Target
Cytochrome P450 1A2
Ligand
BDBM50443881
Substrate
Meas. Tech.
ChEMBL_1277841 (CHEMBL3097775)
IC50
5500±n/a nM
Citation
 Fukunaga, KUehara, FAritomo, KShoda, AHiki, SOkuyama, MUsui, YWatanabe, KYamakoshi, KKohara, THanano, TTanaka, HTsuchiya, SSunada, SSaito, KEguchi, JYuki, SAsano, STanaka, SMori, AYamagami, KBaba, HHorikawa, TFujimura, M 2-(2-Phenylmorpholin-4-yl)pyrimidin-4(3H)-ones; a new class of potent, selective and orally active glycogen synthase kinase-3ß inhibitors. Bioorg Med Chem Lett 23:6933-7 (2013)  
Target
Name:
Cytochrome P450 1A2
Synonyms:
CP1A2_HUMAN CYPIA2 Cytochrome P(3)450 Cytochrome P450 1A2 (CYP1A2) Cytochrome P450-P3
Type:
Enzyme
Mol. Mass.:
58423.38
Organism:
Homo sapiens (Human)
Description:
P05177
Residue:
516
  
Inhibitor
Name:
BDBM50443881
Synonyms:
CHEMBL3091531
Type:
Small organic molecule
Emp. Form.:
C20H18F2N4O2
Mol. Mass.:
384.3793
SMILES:
Cn1c(nc(cc1=O)-c1ccncc1F)N1CCO[C@H](C1)c1ccc(F)cc1
: