Target
Neutrophil elastase
Ligand
BDBM50444303
Substrate
Meas. Tech.
ChEMBL_1278122 (CHEMBL3095810)
IC50
5190±n/a nM
Citation
 Lucas, SDGonçalves, LMCarvalho, LACorreia, HFDa Costa, EMGuedes, RAMoreira, RGuedes, RC Optimization of O3-acyl kojic acid derivatives as potent and selective human neutrophil elastase inhibitors. J Med Chem 56:9802-6 (2014)  
Target
Name:
Neutrophil elastase
Synonyms:
Bone marrow serine protease Coagulation factor X ELANE Elastase HLE Leukocyte elastase Medullasin Neutrophil elastase (HNE) PMN elastase Trypsin
Type:
Enzyme
Mol. Mass.:
28532.38
Organism:
Homo sapiens (Human)
Description:
P08246
Residue:
267
  
Inhibitor
Name:
BDBM50444303
Synonyms:
CHEMBL3093811
Type:
Small organic molecule
Emp. Form.:
C26H18N2O4S
Mol. Mass.:
454.497
SMILES:
O=C(Oc1cn(c(CSc2nc3ccccc3o2)cc1=O)-c1ccccc1)c1ccccc1
: