Target
Bifunctional epoxide hydrolase 2
Ligand
BDBM50180740
Substrate
Meas. Tech.
ChEMBL_1281542 (CHEMBL3102108)
IC50
207000±n/a nM
Citation
 Achenbach, JKlingler, FMBlöcher, RMoser, DHäfner, AKRödl, CBKretschmer, SKrüger, BLöhr, FStark, HHofmann, BSteinhilber, DProschak, E Exploring the chemical space of multitarget ligands using aligned self-organizing maps. ACS Med Chem Lett 4:1169-72 (2013)  
Target
Name:
Bifunctional epoxide hydrolase 2
Synonyms:
Cytosolic epoxide hydrolase 2 EPHX2 HYES_HUMAN Soluble epoxide hydrolase (sEH) | epoxide hydrolase 2, cytoplasmic
Type:
Enzyme
Mol. Mass.:
62613.07
Organism:
Homo sapiens (Human)
Description:
P34913
Residue:
555
  
Inhibitor
Name:
BDBM50180740
Synonyms:
2-(furan-2-yl)-1H-benzo[d]imidazole US9138393, Fuberidazole fuberidazole
Type:
Small organic molecule
Emp. Form.:
C11H8N2O
Mol. Mass.:
184.194
SMILES:
c1coc(c1)-c1nc2ccccc2[nH]1
: